{"text_format":"1","workbook":"xlsx","n_sheets":13,"sheets":["Overall","August","September","October","November","December","January","February","March","April","May","Mini Leagues","Jokers"],"not_rendered":{"charts":0,"images":8,"macros":1,"external_links":0,"defined_names":0,"comments":0,"pivot_tables":0},"unopened":[],"bounds":{"document_bytes":16777216,"sheet_cells":100000,"rows_first":2000,"rows_last":500,"rows_between":2000,"halvings":0,"cell_chars":16384,"cell_head_chars":4096},"cells_cut":0,"cells_raw":0,"read":"whole","date_system":"1900"}

{"sheet":"Overall","index":0,"n_rows":79,"n_cols":14,"rows_kept":79,"cut":false,"hidden":false,"merged":[]}
[]
["No.","Name","Team","2022-08-01","2022-09-01","2022-10-01","2022-11-01","2022-12-01","2023-01-01","2023-02-01","2023-03-01","2023-04-01","2023-05-01","Total"]
[1,"Dean Kelly","Drean Team",{"$f":"HLOOKUP(B3,August!$H$1:$CF$83,83,FALSE)","v":180},{"$f":"HLOOKUP(B3,September!$H$1:$CF$37,37,FALSE)","v":78},{"$f":"HLOOKUP(B3,October!$H$1:$CF$78,78,FALSE)","v":244},{"$f":"HLOOKUP(B3,November!$H$1:$CF$39,39,FALSE)","v":70},{"$f":"HLOOKUP(B3,December!$H$1:$CF$37,37,FALSE)","v":75},{"$f":"HLOOKUP(B3,January!$H$1:$CF$53,53,FALSE)","v":34},null,null,null,null,{"$f":"SUM(D3:M3)","v":681}]
[2,"Rory Ellard","Ipspich",{"$f":"HLOOKUP(B4,August!$H$1:$CF$83,83,FALSE)","v":205},{"$f":"HLOOKUP(B4,September!$H$1:$CF$37,37,FALSE)","v":58},{"$f":"HLOOKUP(B4,October!$H$1:$CF$78,78,FALSE)","v":219},{"$f":"HLOOKUP(B4,November!$H$1:$CF$39,39,FALSE)","v":65},{"$f":"HLOOKUP(B4,December!$H$1:$CF$37,37,FALSE)","v":90},{"$f":"HLOOKUP(B4,January!$H$1:$CF$53,53,FALSE)","v":39},null,null,null,null,{"$f":"SUM(D4:M4)","v":676}]
[3,"James Keville","Doesn't Mata",{"$f":"HLOOKUP(B5,August!$H$1:$CF$83,83,FALSE)","v":205},{"$f":"HLOOKUP(B5,September!$H$1:$CF$37,37,FALSE)","v":63},{"$f":"HLOOKUP(B5,October!$H$1:$CF$78,78,FALSE)","v":204},{"$f":"HLOOKUP(B5,November!$H$1:$CF$39,39,FALSE)","v":75},{"$f":"HLOOKUP(B5,December!$H$1:$CF$37,37,FALSE)","v":70},{"$f":"HLOOKUP(B5,January!$H$1:$CF$53,53,FALSE)","v":49},null,null,null,null,{"$f":"SUM(D5:M5)","v":666}]
[4,"Graham Pierpoint","Klopp's Kops",{"$f":"HLOOKUP(B6,August!$H$1:$CF$83,83,FALSE)","v":190},{"$f":"HLOOKUP(B6,September!$H$1:$CF$37,37,FALSE)","v":58},{"$f":"HLOOKUP(B6,October!$H$1:$CF$78,78,FALSE)","v":239},{"$f":"HLOOKUP(B6,November!$H$1:$CF$39,39,FALSE)","v":60},{"$f":"HLOOKUP(B6,December!$H$1:$CF$37,37,FALSE)","v":70},{"$f":"HLOOKUP(B6,January!$H$1:$CF$53,53,FALSE)","v":44},null,null,null,null,{"$f":"SUM(D6:M6)","v":661}]
[5,"Philip Jordan","Frankie's Army",{"$f":"HLOOKUP(B7,August!$H$1:$CF$83,83,FALSE)","v":197},{"$f":"HLOOKUP(B7,September!$H$1:$CF$37,37,FALSE)","v":75},{"$f":"HLOOKUP(B7,October!$H$1:$CF$78,78,FALSE)","v":216},{"$f":"HLOOKUP(B7,November!$H$1:$CF$39,39,FALSE)","v":71},{"$f":"HLOOKUP(B7,December!$H$1:$CF$37,37,FALSE)","v":73},{"$f":"HLOOKUP(B7,January!$H$1:$CF$53,53,FALSE)","v":27},null,null,null,null,{"$f":"SUM(D7:M7)","v":659}]
[6,"Anastas Popov","Super Strong Saints",{"$f":"HLOOKUP(B8,August!$H$1:$CF$83,83,FALSE)","v":204},{"$f":"HLOOKUP(B8,September!$H$1:$CF$37,37,FALSE)","v":74},{"$f":"HLOOKUP(B8,October!$H$1:$CF$78,78,FALSE)","v":196},{"$f":"HLOOKUP(B8,November!$H$1:$CF$39,39,FALSE)","v":67},{"$f":"HLOOKUP(B8,December!$H$1:$CF$37,37,FALSE)","v":69},{"$f":"HLOOKUP(B8,January!$H$1:$CF$53,53,FALSE)","v":34},null,null,null,null,{"$f":"SUM(D8:M8)","v":644}]
{"$rows_left_out":72}
{"sheet":"August","index":1,"n_rows":83,"n_cols":84,"rows_kept":83,"cut":false,"hidden":false,"merged":[[1,1,1,4]]}
[null,null,null,null,null,null,null,"Aidan Scanlon","Aidan White","Anastas Popov","Andrew Keohan","Andy Dunne","Bobby Hynes","Brendan Maguire","Brian Haughton","Brian Mullen","Brian Prendergast","Caroline Carroll","Cathal Thornton","Chris Keohan","Christina Morgan","Ciara Walsh","Ciaran Healy","Ciaran O'Hart","Ciaran Rooney","Colm Cahill","Con McSweeney","Conor MacMahon","Craig Calvert","Darragh Kenny","Dave McGinley","David Cooney","David Lavelle","Dean Kelly","Derek McDonald","Dylan Delaney","Dylan O'Riordan","Eoghan Farrelly","Frank McSweeney","Gareth Pierpoint","Gary Donnelly","Gary Fitzpatrick","Gary McGurk","Gavin Morgan","Gerard McCluskey","Gerry Draper","Gerry Moore","Graham Pierpoint","Ian McSweeney","James Keville","Javier Suarez","Jenny Behan","Joe Behan","Joe Turner","John Brophy","John Hempenstall","John Massey","Johno Percy","Jonathan Fox","Joseph Kavanagh","Keith Ryan","Kieran Killeen","Liam Keohan","Lionel Knott","Micheal Joyce","Monica Collins","Niall Carroll","Niall Gregory","Paul Moore","Paul Prendergast","Phil Doyle","Philip Jordan","Richard Johnston","Robert Hynes","Roisin Joyce","Ronan Rafferty","Rory Ellard","Sarah Coward","Sean Cleary","Sean O'Mairtin","Shane Finnan","Shane Hempenstall","Simon Scanlon","Tommy Hamill"]
["Date","Teams",null,null,null,"Time"]
["2022-08-05","Crystal Palace",0,2,"Arsenal","19:45:00",null,5,5,10,0,0,5,10,5,10,5,0,0,5,0,5,5,5,5,5,5,5,0,0,0,5,10,0,5,5,5,5,0,5,5,0,5,10,"-",0,5,10,10,5,5,0,5,0,5,10,5,0,5,5,10,0,5,0,0,5,0,0,5,0,0,10,0,0,0,0,5,0,5,0,5,5,0,0]
["2022-08-06","Fulham",2,2,"Liverpool","12:30:00",null,0,0,0,0,0,0,0,0,0,0,0,0,0,0,10,0,0,0,0,0,0,0,0,0,0,0,0,0,0,0,0,0,0,0,0,0,0,0,0,0,0,0,0,0,0,0,0,0,0,0,0,0,0,0,0,0,0,0,0,0,0,0,0,0,0,0,0,0,0,0,0,0,0,0,0,0,0]
["2022-08-06","Bournemouth",2,0,"Aston Villa","15:00:00",null,0,0,0,0,0,0,0,0,0,0,0,5,0,0,0,0,5,0,0,0,0,0,0,5,0,0,0,0,0,0,0,0,0,0,0,0,0,5,0,0,0,0,0,0,0,0,0,0,0,0,0,0,0,0,0,0,0,5,0,0,0,0,0,0,0,0,0,5,0,0,0,0,0,0,0,0,0]
["2022-08-06","Leeds Utd",2,1,"Wolves","15:00:00",null,0,0,0,0,10,0,5,0,0,10,0,0,0,5,0,0,0,0,0,10,0,0,0,0,10,0,0,0,10,0,10,5,0,0,0,5,0,10,0,0,0,0,10,0,10,10,5,10,0,0,0,5,0,0,0,0,10,0,0,0,10,5,5,10,0,0,10,0,0,0,0,0,5,0,0,0,5]
["2022-08-06","Newcastle",2,0,"Nottingham Forest","15:00:00",null,5,5,10,10,5,5,5,10,0,10,10,10,10,10,5,10,10,10,5,10,10,5,10,5,0,5,10,5,5,0,5,0,10,5,5,10,10,10,5,5,10,0,5,5,10,10,5,10,10,10,5,5,5,5,0,10,5,5,0,5,10,10,5,10,5,0,5,5,0,10,5,10,5,5,5,5,5]
["2022-08-06","Spurs",4,1,"Southampton","15:00:00",null,5,5,5,5,5,5,5,5,5,5,5,5,5,5,5,5,5,5,5,5,5,5,5,5,5,5,5,5,5,5,5,5,5,5,5,5,5,0,5,5,5,5,5,5,0,5,5,5,5,5,5,5,5,5,5,5,5,5,5,5,5,5,5,5,5,10,5,5,5,5,5,5,5,5,5,5,5]
{"$rows_left_out":76}
{"sheet":"September","index":2,"n_rows":37,"n_cols":84,"rows_kept":37,"cut":false,"hidden":false,"merged":[[1,1,1,4]]}
[null,null,null,null,null,null,null,"Aidan Scanlon","Aidan White","Anastas Popov","Andrew Keohan","Andy Dunne","Bobby Hynes","Brendan Maguire","Brian Haughton","Brian Mullen","Brian Prendergast","Caroline Carroll","Cathal Thornton","Chris Keohan","Christina Morgan","Ciara Walsh","Ciaran Healy","Ciaran O'Hart","Ciaran Rooney","Colm Cahill","Con McSweeney","Conor MacMahon","Craig Calvert","Darragh Kenny","Dave McGinley","David Cooney","David Lavelle","Dean Kelly","Derek McDonald","Dylan Delaney","Dylan O'Riordan","Eoghan Farrelly","Frank McSweeney","Gareth Pierpoint","Gary Donnelly","Gary Fitzpatrick","Gary McGurk","Gavin Morgan","Gerard McCluskey","Gerry Draper","Gerry Moore","Graham Pierpoint","Ian McSweeney","James Keville","Javier Suarez","Jenny Behan","Joe Behan","Joe Turner","John Brophy","John Hempenstall","John Massey","Johno Percy","Jonathan Fox","Joseph Kavanagh","Keith Ryan","Kieran Killeen","Liam Keohan","Lionel Knott","Micheal Joyce","Monica Collins","Niall Carroll","Niall Gregory","Paul Moore","Paul Prendergast","Phil Doyle","Philip Jordan","Richard Johnston","Robert Hynes","Roisin Joyce","Ronan Rafferty","Rory Ellard","Sarah Coward","Sean Cleary","Sean O'Mairtin","Shane Finnan","Shane Hempenstall","Simon Scanlon","Tommy Hamill"]
["Date","Teams",null,null,null,"Time"]
["2022-09-01","Leicester",0,1,"Man Utd","20:00:00",null,5,10,10,5,0,0,5,5,0,10,5,5,10,0,5,0,0,5,0,0,5,5,5,5,5,0,5,5,5,10,5,0,5,5,0,0,0,0,0,0,5,0,0,0,5,5,0,0,5,0,0,10,5,10,0,5,10,5,5,5,5,0,0,5,5,5,0,5,5,5,0,5,0,5,5,5,0]
["2022-09-03","Everton",0,0,"Liverpool","12:30:00",null,0,0,0,0,0,0,0,0,0,0,0,0,0,0,5,"-",0,0,0,5,0,0,0,0,0,0,0,0,0,0,5,0,0,0,5,0,0,0,0,0,0,0,0,0,0,0,0,5,0,0,5,0,0,5,0,0,0,0,0,5,5,0,0,5,0,0,0,0,0,0,0,0,0,0,0,5,0]
["2022-09-03","Brentford",5,2,"Leeds Utd","15:00:00",null,0,0,5,0,0,0,0,0,0,0,0,0,0,5,0,"-",0,5,5,0,5,0,0,5,5,5,5,5,0,0,5,5,0,5,0,0,5,5,0,0,0,0,0,5,0,0,5,5,5,5,5,5,0,0,0,0,0,0,0,0,5,5,5,0,0,0,5,0,5,5,0,5,5,0,0,5,0]
["2022-09-03","Chelsea",2,1,"West Ham","15:00:00",null,0,10,5,0,5,5,10,10,10,10,0,5,10,5,0,"-",5,10,5,0,10,10,10,10,10,10,10,10,10,5,10,5,10,10,10,5,5,5,0,0,5,5,10,5,5,5,5,5,5,10,5,5,10,0,5,10,5,0,5,0,10,5,5,10,5,10,10,10,5,5,5,10,10,10,5,0,5]
["2022-09-03","Newcastle",0,0,"Crystal Palace","15:00:00",null,0,0,0,0,0,5,0,0,0,0,5,0,0,0,5,"-",5,0,0,0,0,0,0,0,0,0,5,0,0,0,0,5,0,0,0,0,0,0,0,0,0,5,0,0,0,0,5,0,0,0,0,0,0,0,0,0,0,5,0,0,0,0,0,0,0,0,0,5,0,0,5,0,0,0,0,0,0]
["2022-09-03","Nottingham Forest",2,3,"Bournemouth","15:00:00",null,0,0,0,0,0,0,0,0,0,0,0,0,0,5,0,"-",0,0,0,0,0,0,0,0,0,0,0,0,0,0,0,0,0,0,0,0,0,0,0,0,0,0,0,5,0,0,0,0,0,0,0,0,0,0,0,0,0,0,0,0,5,0,0,0,0,0,0,0,0,0,0,0,0,0,0,0,0]
{"$rows_left_out":30}
{"sheet":"October","index":3,"n_rows":78,"n_cols":84,"rows_kept":78,"cut":false,"hidden":false,"merged":[[1,1,1,4]]}
[null,null,null,null,null,null,null,"Aidan Scanlon","Aidan White","Anastas Popov","Andrew Keohan","Andy Dunne","Bobby Hynes","Brendan Maguire","Brian Haughton","Brian Mullen","Brian Prendergast","Caroline Carroll","Cathal Thornton","Chris Keohan","Christina Morgan","Ciara Walsh","Ciaran Healy","Ciaran O'Hart","Ciaran Rooney","Colm Cahill","Con McSweeney","Conor MacMahon","Craig Calvert","Darragh Kenny","Dave McGinley","David Cooney","David Lavelle","Dean Kelly","Derek McDonald","Dylan Delaney","Dylan O'Riordan","Eoghan Farrelly","Frank McSweeney","Gareth Pierpoint","Gary Donnelly","Gary Fitzpatrick","Gary McGurk","Gavin Morgan","Gerard McCluskey","Gerry Draper","Gerry Moore","Graham Pierpoint","Ian McSweeney","James Keville","Javier Suarez","Jenny Behan","Joe Behan","Joe Turner","John Brophy","John Hempenstall","John Massey","Johno Percy","Jonathan Fox","Joseph Kavanagh","Keith Ryan","Kieran Killeen","Liam Keohan","Lionel Knott","Micheal Joyce","Monica Collins","Niall Carroll","Niall Gregory","Paul Moore","Paul Prendergast","Phil Doyle","Philip Jordan","Richard Johnston","Robert Hynes","Roisin Joyce","Ronan Rafferty","Rory Ellard","Sarah Coward","Sean Cleary","Sean O'Mairtin","Shane Finnan","Shane Hempenstall","Simon Scanlon","Tommy Hamill"]
["Date","Teams",null,null,null,"Time"]
["2022-10-01","Arsenal",3,1,"Spurs","12:30:00",null,10,0,0,10,5,0,5,5,5,0,0,0,0,5,5,"-",0,5,0,5,0,0,0,0,5,0,0,0,0,5,0,0,0,0,0,5,5,5,5,5,0,0,0,5,0,0,0,0,0,0,0,5,0,5,5,5,5,0,0,0,0,0,5,5,0,5,0,0,0,0,0,5,0,5,0,0,0]
["2022-10-01","Bournemouth",0,0,"Brentford","15:00:00",null,0,5,0,0,0,5,5,0,5,0,5,0,0,5,0,"-",0,0,5,0,0,5,0,5,5,0,0,5,0,0,5,0,0,0,0,5,5,0,5,0,5,0,0,0,0,0,5,0,0,10,0,0,0,0,0,0,0,5,0,0,0,5,5,0,0,0,5,5,5,5,0,0,5,0,0,0,5]
["2022-10-01","Crystal Palace",1,2,"Chelsea","15:00:00",null,5,5,5,0,0,10,10,5,10,10,0,10,5,5,0,"-",5,10,0,10,10,0,5,0,5,0,5,0,10,0,0,10,10,5,0,5,5,10,10,0,10,10,10,0,0,5,0,5,5,0,0,5,10,0,0,0,0,10,10,0,0,0,10,5,5,0,0,5,0,10,5,0,0,0,5,10,10]
["2022-10-01","Fulham",1,4,"Newcastle","15:00:00",null,5,0,0,0,5,0,0,0,5,0,0,5,0,0,5,"-",0,0,0,0,5,0,0,0,0,5,0,5,0,5,0,0,0,0,0,5,0,0,0,0,0,0,0,0,0,0,0,5,0,0,0,5,5,5,0,5,0,0,0,0,0,0,5,0,5,0,0,0,0,5,0,0,0,0,5,5,0]
["2022-10-01","Liverpool",3,3,"Brighton","15:00:00",null,0,0,0,0,0,0,0,0,0,0,0,0,0,0,0,"-",0,0,0,0,0,0,0,0,0,0,0,0,0,0,5,0,0,0,0,0,0,0,0,0,0,0,0,0,0,0,0,0,0,5,0,0,0,0,0,0,0,0,0,0,0,0,0,0,0,0,0,0,0,0,0,0,0,0,0,0,0]
["2022-10-01","Southampton",1,2,"Everton","15:00:00",null,0,0,0,0,5,0,0,0,5,0,0,0,0,0,0,"-",0,0,0,0,0,0,0,0,0,0,5,10,5,0,0,10,10,0,0,0,0,0,0,0,0,0,0,0,0,0,0,0,10,0,0,0,0,0,0,0,5,10,0,5,0,0,10,10,0,0,0,0,0,0,0,10,0,0,5,0,10]
{"$rows_left_out":71}
{"sheet":"November","index":4,"n_rows":39,"n_cols":84,"rows_kept":39,"cut":false,"hidden":false,"merged":[[1,1,1,4]]}
[null,null,null,null,null,null,null,"Aidan Scanlon","Aidan White","Anastas Popov","Andrew Keohan","Andy Dunne","Bobby Hynes","Brendan Maguire","Brian Haughton","Brian Mullen","Brian Prendergast","Caroline Carroll","Cathal Thornton","Chris Keohan","Christina Morgan","Ciara Walsh","Ciaran Healy","Ciaran O'Hart","Ciaran Rooney","Colm Cahill","Con McSweeney","Conor MacMahon","Craig Calvert","Darragh Kenny","Dave McGinley","David Cooney","David Lavelle","Dean Kelly","Derek McDonald","Dylan Delaney","Dylan O'Riordan","Eoghan Farrelly","Frank McSweeney","Gareth Pierpoint","Gary Donnelly","Gary Fitzpatrick","Gary McGurk","Gavin Morgan","Gerard McCluskey","Gerry Draper","Gerry Moore","Graham Pierpoint","Ian McSweeney","James Keville","Javier Suarez","Jenny Behan","Joe Behan","Joe Turner","John Brophy","John Hempenstall","John Massey","Johno Percy","Jonathan Fox","Joseph Kavanagh","Keith Ryan","Kieran Killeen","Liam Keohan","Lionel Knott","Micheal Joyce","Monica Collins","Niall Carroll","Niall Gregory","Paul Moore","Paul Prendergast","Phil Doyle","Philip Jordan","Richard Johnston","Robert Hynes","Roisin Joyce","Ronan Rafferty","Rory Ellard","Sarah Coward","Sean Cleary","Sean O'Mairtin","Shane Finnan","Shane Hempenstall","Simon Scanlon","Tommy Hamill"]
["Date","Teams",null,null,null,"Time"]
["2022-11-05","Leeds Utd",4,3,"Bournemouth","15:00:00",null,5,5,5,"-",5,5,5,0,5,5,5,0,5,5,5,"-",5,5,5,5,0,0,5,5,5,0,5,5,5,5,5,5,5,5,0,5,5,5,5,5,5,5,5,"-",5,5,5,0,5,5,5,5,0,5,"-",5,5,5,0,5,5,0,5,5,5,5,5,5,5,0,5,5,5,"-",5,5,5]
["2022-11-05","Man City",2,1,"Fulham","15:00:00",null,5,5,5,"-",5,5,5,5,5,5,5,5,5,0,10,"-",5,5,5,5,5,5,5,5,5,5,5,5,5,5,5,5,5,5,5,5,5,10,5,0,5,5,5,"-",5,5,5,5,5,5,5,5,5,5,"-",5,5,5,5,5,5,5,5,5,5,5,5,5,5,5,5,5,5,"-",5,10,5]
["2022-11-05","Nottingham Forest",2,2,"Brentford","15:00:00",null,5,0,0,"-",5,0,5,5,5,0,0,0,5,0,5,"-",5,5,5,5,0,0,0,5,5,0,5,5,5,5,0,5,5,0,0,5,5,0,5,5,5,0,5,"-",10,5,0,5,5,5,0,0,5,0,"-",0,5,5,0,5,0,0,0,5,0,0,5,0,0,0,5,0,10,"-",0,0,0]
["2022-11-05","Wolves",2,3,"Brighton","15:00:00",null,10,5,5,"-",0,5,5,0,5,0,5,0,5,0,5,"-",5,5,0,5,0,5,0,0,0,5,5,5,5,5,5,5,5,5,5,0,5,0,5,0,5,5,0,"-",5,5,5,5,5,5,5,5,5,5,"-",5,5,0,5,5,0,5,0,5,5,0,5,5,5,5,5,5,5,"-",5,0,0]
["2022-11-05","Everton",0,2,"Leicester","17:30:00",null,0,0,0,"-",0,0,0,0,0,0,0,5,0,0,0,"-",0,0,0,0,0,0,0,0,0,5,0,0,0,0,0,0,0,0,0,0,0,0,0,0,0,0,0,0,0,0,0,0,0,0,0,0,0,0,"-",5,5,5,0,0,0,0,0,5,0,0,0,0,5,0,0,0,0,"-",0,0,0]
["2022-11-06","Chelsea",0,1,"Arsenal","12:00:00",null,0,0,0,"-",0,0,5,0,5,0,0,5,5,5,0,"-",0,5,0,5,5,0,5,0,0,5,0,0,0,5,0,0,10,0,0,0,5,0,0,5,0,0,0,5,0,10,0,0,0,0,5,0,0,0,"-",5,0,5,0,0,0,0,5,5,5,5,0,5,0,0,0,0,0,"-",0,0,0]
{"$rows_left_out":32}
{"sheet":"December","index":5,"n_rows":37,"n_cols":84,"rows_kept":37,"cut":false,"hidden":false,"merged":[[1,1,1,4]]}
[null,null,null,null,null,null,null,"Aidan Scanlon","Aidan White","Anastas Popov","Andrew Keohan","Andy Dunne","Bobby Hynes","Brendan Maguire","Brian Haughton","Brian Mullen","Brian Prendergast","Caroline Carroll","Cathal Thornton","Chris Keohan","Christina Morgan","Ciara Walsh","Ciaran Healy","Ciaran O'Hart","Ciaran Rooney","Colm Cahill","Con McSweeney","Conor MacMahon","Craig Calvert","Darragh Kenny","Dave McGinley","David Cooney","David Lavelle","Dean Kelly","Derek McDonald","Dylan Delaney","Dylan O'Riordan","Eoghan Farrelly","Frank McSweeney","Gareth Pierpoint","Gary Donnelly","Gary Fitzpatrick","Gary McGurk","Gavin Morgan","Gerard McCluskey","Gerry Draper","Gerry Moore","Graham Pierpoint","Ian McSweeney","James Keville","Javier Suarez","Jenny Behan","Joe Behan","Joe Turner","John Brophy","John Hempenstall","John Massey","Johno Percy","Jonathan Fox","Joseph Kavanagh","Keith Ryan","Kieran Killeen","Liam Keohan","Lionel Knott","Micheal Joyce","Monica Collins","Niall Carroll","Niall Gregory","Paul Moore","Paul Prendergast","Phil Doyle","Philip Jordan","Richard Johnston","Robert Hynes","Roisin Joyce","Ronan Rafferty","Rory Ellard","Sarah Coward","Sean Cleary","Sean O'Mairtin","Shane Finnan","Shane Hempenstall","Simon Scanlon","Tommy Hamill"]
["Date","Teams",null,null,null,"Time"]
["2022-12-26","Brentford",2,2,"Spurs","12:30:00",null,0,5,0,"-",0,5,5,0,0,0,0,0,0,0,0,"-",0,5,0,0,0,5,0,5,10,0,0,"-",0,0,0,0,5,0,0,5,5,0,10,5,5,0,0,"-",0,10,10,0,0,5,5,0,0,0,0,0,0,0,0,10,0,0,0,0,0,0,0,0,10,5,0,0,5,"-","-",0,5]
["2022-12-26","Crystal Palace",0,3,"Fulham","15:00:00",null,0,0,0,"-",0,0,0,0,0,0,0,0,0,5,0,"-",0,0,0,0,0,0,0,0,0,0,0,"-",0,0,0,0,0,0,0,0,0,0,0,0,0,0,0,0,0,0,0,0,0,0,0,0,0,5,0,0,0,5,0,0,0,0,0,0,0,0,0,0,0,0,0,0,0,"-","-",0,0]
["2022-12-26","Everton",1,2,"Wolves","15:00:00",null,0,0,0,"-",0,0,0,0,0,0,10,0,0,0,0,"-",0,0,0,0,0,0,0,0,0,0,0,"-",0,0,0,0,0,0,0,0,0,0,0,0,0,0,10,0,0,0,0,5,0,0,0,0,0,0,0,0,0,10,10,0,0,0,0,10,0,0,0,0,0,0,0,0,10,"-","-",0,0]
["2022-12-26","Leicester",0,3,"Newcastle","15:00:00",null,5,5,5,"-",0,0,5,0,5,0,5,0,5,5,0,"-",0,5,0,0,0,5,0,0,0,0,0,"-",5,5,5,5,5,0,0,0,5,0,5,0,5,0,0,5,0,5,5,5,0,0,5,5,5,5,5,5,0,0,5,5,0,5,5,5,0,5,0,5,0,5,0,5,0,"-","-",10,5]
["2022-12-26","Southampton",1,3,"Brighton","15:00:00",null,5,0,0,"-",0,5,0,0,5,0,0,0,0,0,0,"-",0,0,0,0,0,0,0,0,0,0,0,"-",0,5,0,5,0,0,5,0,0,0,0,5,5,5,5,0,0,0,0,0,0,0,0,5,0,5,5,5,5,0,0,0,0,5,0,10,5,5,0,5,0,5,0,5,5,"-","-",0,0]
["2022-12-26","Aston Villa",1,3,"Liverpool","17:30:00",null,5,5,5,"-",0,5,5,5,5,0,5,0,10,10,0,"-",5,5,5,5,0,5,5,5,0,0,10,"-",5,10,5,5,5,0,10,10,0,0,5,5,5,5,5,10,10,5,5,5,0,0,0,5,5,5,5,10,10,5,5,0,5,5,5,0,5,5,5,5,0,5,5,5,5,"-","-",5,0]
{"$rows_left_out":30}
{"sheet":"January","index":6,"n_rows":53,"n_cols":84,"rows_kept":53,"cut":false,"hidden":false,"merged":[[1,1,1,4]]}
[null,null,null,null,null,null,null,"Aidan Scanlon","Aidan White","Anastas Popov","Andrew Keohan","Andy Dunne","Bobby Hynes","Brendan Maguire","Brian Haughton","Brian Mullen","Brian Prendergast","Caroline Carroll","Cathal Thornton","Chris Keohan","Christina Morgan","Ciara Walsh","Ciaran Healy","Ciaran O'Hart","Ciaran Rooney","Colm Cahill","Con McSweeney","Conor MacMahon","Craig Calvert","Darragh Kenny","Dave McGinley","David Cooney","David Lavelle","Dean Kelly","Derek McDonald","Dylan Delaney","Dylan O'Riordan","Eoghan Farrelly","Frank McSweeney","Gareth Pierpoint","Gary Donnelly","Gary Fitzpatrick","Gary McGurk","Gavin Morgan","Gerard McCluskey","Gerry Draper","Gerry Moore","Graham Pierpoint","Ian McSweeney","James Keville","Javier Suarez","Jenny Behan","Joe Behan","Joe Turner","John Brophy","John Hempenstall","John Massey","Johno Percy","Jonathan Fox","Joseph Kavanagh","Keith Ryan","Kieran Killeen","Liam Keohan","Lionel Knott","Micheal Joyce","Monica Collins","Niall Carroll","Niall Gregory","Paul Moore","Paul Prendergast","Phil Doyle","Philip Jordan","Richard Johnston","Robert Hynes","Roisin Joyce","Ronan Rafferty","Rory Ellard","Sarah Coward","Sean Cleary","Sean O'Mairtin","Shane Finnan","Shane Hempenstall","Simon Scanlon","Tommy Hamill"]
["Date","Teams",null,null,null,"Time"]
["2023-01-01","Spurs",0,2,"Aston Villa","14:00:00",null,0,0,0,"-",0,0,0,0,0,0,0,0,0,0,0,"-",0,0,0,0,0,0,0,0,0,0,0,0,0,0,0,0,0,0,0,0,0,"-",0,0,0,0,0,0,0,0,0,0,"-","-",0,0,0,0,0,0,0,0,0,0,0,0,0,0,0,0,0,0,0,0,5,0,0,"-","-",0,0]
["2023-01-01","Nottingham Forest",1,1,"Chelsea","16:30:00",null,0,0,0,"-",0,0,0,0,0,0,0,0,0,0,0,"-",0,0,0,0,0,0,0,0,0,0,0,0,0,0,0,0,0,0,10,0,0,"-",0,10,0,0,0,0,0,0,0,0,"-","-",0,0,0,0,0,0,0,0,0,0,0,0,0,0,0,0,10,0,10,0,0,0,0,"-","-",0,0]
["2023-01-02","Brentford",3,1,"Liverpool","17:30:00",null,0,0,0,"-",0,0,0,0,0,0,0,"-",0,0,5,"-",0,0,5,0,5,0,0,0,0,0,0,5,0,0,0,0,0,"-",0,0,0,"-",0,0,0,0,0,0,0,0,0,0,"-","-",0,0,0,0,0,0,0,0,0,0,0,0,0,0,0,0,0,0,0,0,0,0,0,"-","-",0,0]
["2023-01-03","Arsenal",0,0,"Newcastle","19:45:00",null,0,5,0,"-",5,0,0,0,0,0,0,"-",5,0,0,"-",0,0,0,0,0,0,5,0,5,5,0,0,5,0,5,5,0,"-",0,0,0,"-",0,0,5,0,5,0,0,0,5,0,"-","-",5,0,5,5,5,0,5,0,0,0,5,0,0,0,5,0,5,0,0,0,0,0,0,"-","-",5,0]
["2023-01-03","Everton",1,4,"Brighton","19:45:00",null,0,0,5,"-",0,0,0,0,0,0,0,"-",0,0,0,"-",0,5,0,0,0,0,5,0,0,5,0,0,5,5,0,0,0,"-",0,0,0,"-",5,0,5,0,5,0,5,0,0,0,"-","-",0,5,0,0,0,5,5,0,0,0,0,5,0,5,0,0,0,5,0,5,0,0,0,"-","-",0,0]
["2023-01-03","Leicester",0,1,"Fulham","19:45:00",null,0,0,0,"-",0,0,0,0,0,0,0,"-",0,5,0,"-",0,0,0,0,0,0,5,0,0,0,0,0,0,10,0,0,0,"-",0,0,0,"-",0,0,0,0,0,0,0,0,0,0,"-","-",0,0,0,5,0,0,0,0,0,0,0,0,0,0,0,0,0,0,0,0,0,0,0,"-","-",5,5]
{"$rows_left_out":46}
{"sheet":"February","index":7,"n_rows":42,"n_cols":6,"rows_kept":42,"cut":false,"hidden":false,"merged":[[1,1,1,4]]}
[]
["Date","Teams",null,null,null,"Time"]
["2023-02-04","Aston Villa",null,null,"Leicester","15:00:00"]
["2023-02-04","Brentford",null,null,"Southampton","15:00:00"]
["2023-02-04","Brighton",null,null,"Bournemouth","15:00:00"]
["2023-02-04","Chelsea",null,null,"Fulham","15:00:00"]
["2023-02-04","Everton",null,null,"Arsenal","15:00:00"]
["2023-02-04","Man Utd",null,null,"Crystal Palace","15:00:00"]
{"$rows_left_out":35}
{"sheet":"March","index":8,"n_rows":32,"n_cols":6,"rows_kept":32,"cut":false,"hidden":false,"merged":[[1,1,1,4]]}
[]
["Date","Teams",null,null,null,"Time"]
["2023-03-04","Arsenal",null,null,"Bournemouth","15:00:00"]
["2023-03-04","Aston Villa",null,null,"Crystal Palace","15:00:00"]
["2023-03-04","Brentford",null,null,"Fulham","15:00:00"]
["2023-03-04","Brighton",null,null,"West Ham","15:00:00"]
["2023-03-04","Chelsea",null,null,"Leeds Utd","15:00:00"]
["2023-03-04","Liverpool",null,null,"Man Utd","15:00:00"]
{"$rows_left_out":25}
{"sheet":"April","index":9,"n_rows":62,"n_cols":6,"rows_kept":62,"cut":false,"hidden":false,"merged":[[1,1,1,4]]}
[]
["Date","Teams",null,null,null,"Time"]
["2023-04-01","Arsenal",null,null,"Leeds Utd","15:00:00"]
["2023-04-01","Bournemouth",null,null,"Fulham","15:00:00"]
["2023-04-01","Brighton",null,null,"Brentford","15:00:00"]
["2023-04-01","Chelsea",null,null,"Aston Villa","15:00:00"]
["2023-04-01","Crystal Palace",null,null,"Leicester","15:00:00"]
["2023-04-01","Everton",null,null,"Spurs","15:00:00"]
{"$rows_left_out":55}
{"sheet":"May","index":10,"n_rows":42,"n_cols":6,"rows_kept":42,"cut":false,"hidden":false,"merged":[[1,1,1,4]]}
[]
["Date","Teams",null,null,null,"Time"]
["2023-05-06","Bournemouth",null,null,"Chelsea","15:00:00"]
["2023-05-06","Brighton",null,null,"Everton","15:00:00"]
["2023-05-06","Fulham",null,null,"Leicester","15:00:00"]
["2023-05-06","Liverpool",null,null,"Brentford","15:00:00"]
["2023-05-06","Man City",null,null,"Leeds Utd","15:00:00"]
["2023-05-06","Newcastle",null,null,"Arsenal","15:00:00"]
{"$rows_left_out":35}
{"sheet":"Mini Leagues","index":11,"n_rows":47,"n_cols":11,"rows_kept":47,"cut":false,"hidden":false,"merged":[[41,6,41,10],[2,0,2,4],[2,6,2,10],[14,0,14,4],[17,6,17,10],[39,0,39,4]]}
[]
[]
["Prendergast Maguire Financial Services",null,null,null,null,null,"Alumni CIT"]
["No.","Act.","Name","Team","Pts",null,"No.","Act.","Name","Team","Pts"]
[1,{"$f":"SUMIF(Overall!$B$3:$B$79,C5,Overall!$A$3:$A$79)","v":7},"Sean Cleary","Sean's Superstars",{"$f":"VLOOKUP(C5,Overall!$B$3:$N$79,13,FALSE)","v":641},null,1,{"$f":"SUMIF(Overall!$B$3:$B$79,I5,Overall!$A$3:$A$79)","v":6},"Anastas Popov","Super Strong Saints",{"$f":"VLOOKUP(I5,Overall!$B$3:$N$79,13,FALSE)","v":644}]
[2,{"$f":"SUMIF(Overall!$B$3:$B$79,C6,Overall!$A$3:$A$79)","v":16},"Dylan Delaney","Only Kruls and Horses",{"$f":"VLOOKUP(C6,Overall!$B$3:$N$79,13,FALSE)","v":616},null,2,{"$f":"SUMIF(Overall!$B$3:$B$79,I6,Overall!$A$3:$A$79)","v":12},"Gerry Draper","Everton 10",{"$f":"VLOOKUP(I6,Overall!$B$3:$N$79,13,FALSE)","v":626}]
[3,{"$f":"SUMIF(Overall!$B$3:$B$79,C7,Overall!$A$3:$A$79)","v":22},"Simon Scanlon","Braygulls Utd Celtic",{"$f":"VLOOKUP(C7,Overall!$B$3:$N$79,13,FALSE)","v":601},null,3,{"$f":"SUMIF(Overall!$B$3:$B$79,I7,Overall!$A$3:$A$79)","v":28},"Gavin Morgan","Seventeenth Season Syndrome",{"$f":"VLOOKUP(I7,Overall!$B$3:$N$79,13,FALSE)","v":586}]
[4,{"$f":"SUMIF(Overall!$B$3:$B$79,C8,Overall!$A$3:$A$79)","v":46},"Brendan Maguire","Cantthinkofone",{"$f":"VLOOKUP(C8,Overall!$B$3:$N$79,13,FALSE)","v":544},null,4,{"$f":"SUMIF(Overall!$B$3:$B$79,I8,Overall!$A$3:$A$79)","v":31},"Con McSweeney","Coola_Boolas",{"$f":"VLOOKUP(I8,Overall!$B$3:$N$79,13,FALSE)","v":576}]
{"$rows_left_out":40}
{"sheet":"Jokers","index":12,"n_rows":80,"n_cols":35,"rows_kept":80,"cut":false,"hidden":false,"merged":[]}
["No.","Player","Team Name","Joker",1,2,3,4,5,6,7,8,9,10,11,12,13,14,15,16,17,18,19,20,21,22,23,24,25,26,27,28,29,30,"Total"]
[1,"Aidan Scanlon","St Pats",null,null,null,null,null,null,null,null,null,null,null,null,null,null,null,null,null,null,null,null,null,null,null,null,null,null,null,null,null,null,null,{"$f":"COUNTIF(E2:AH2,\"a\")","v":0}]
[2,"Aidan White","The Ings vs Watkins Conundrum","1-0","a","a",null,null,null,null,null,null,null,null,null,null,null,null,null,null,null,null,null,null,null,null,null,null,null,null,null,null,null,null,2]
[3,"Anastas Popov","Super Strong Saints","1-0","a","a","a","a","a","a","a","a","a",null,null,null,null,null,null,null,null,null,null,null,null,null,null,null,null,null,null,null,null,null,9]
[4,"Andrew Keohan","Allstar Assholes","3-1","a","a","a","a","a","a","a","a","a","a","a","a","a","a","a","a","a","a","a","a","a","a","a","a","a","a","a","a","a","a",30]
[5,"Andy Dunne","Steve McMahon's Tackle","2-0","a","a","a","a","a","a","a","a","a","a","a","a",null,null,null,null,null,null,null,null,null,null,null,null,null,null,null,null,null,null,12]
[6,"Bobby Hynes","Dancing In The Dark","2-1","a","a","a",null,null,null,null,null,null,null,null,null,null,null,null,null,null,null,null,null,null,null,null,null,null,null,null,null,null,null,3]
[7,"Brendan Maguire","Cantthinkofone","2-0","a",null,null,null,null,null,null,null,null,null,null,null,null,null,null,null,null,null,null,null,null,null,null,null,null,null,null,null,null,null,1]
{"$rows_left_out":72}